ODRL Profile for Language Resources
type: Ontology
creator: Pablo Calleja
creator: Penny Labropoulou
creator: Victor Rodriguez Doncel
date: 2020-12-30
description: This ontology is a profile of ODRL and it provides: new odrl:Actions, new odrl:LeftOperands and several new properties intended to describe language resources and intended to be used as conditions in policies. The basis for this work is the 'Rights Information for Language Resources' (http://purl.org/NET/ms-rights)
modified: 2020-12-30
preferred namespace prefix: odrl-lr
comment: The ODRL Profile for Language Resources provides the vocabulary elements to write policies for language resources. This work has been made in the framework of the H2020 Prêt-à-LLOD project (http://pret-a-llod.eu) and it is the result of promoting the 'Rights Information for Language Resources' ontology into a full ODRL-compliant profile
prior version: ms-rights#
version info: 2.2
has resource: pddm-pal.oeg.fi.upm.es
has role: specification
is profile of: core
type: NamedIndividual
type: Profile
license: cc-by4.0

Availability
type: ObjectProperty
domain: LanguageResource
range: Availability
type: NamedIndividual
type: Concept
type: LeftOperand
definition: Used to link a Language Resource to an Availability status.

Conditions of Use
type: ObjectProperty
domain: License
range: Conditions of Use
type: NamedIndividual
type: Concept
definition: Links the resource (distribution) to the conditions of use imposed by the licence; intended as a user-friendly list of basic terms and conditions

Distribution Access Medium
type: ObjectProperty
sub property of: deliveryChannel
domain: Distribution
range: Distribution Access Medium
type: NamedIndividual
type: Concept
definition: Specifies the medium (channel) used for delivery or providing access to the resource

Distribution Rights Holder
type: ObjectProperty
sub property of: rightsHolder
domain: Distribution
range: Agent
type: NamedIndividual
type: Concept
definition: Identifies a person or an organization that holds the distribution rights. The range and scope of distribution rights is defined in the distribution agreement. The distributor in most cases only has a limited licence to distribute the work and collect royalties on behalf of the licensor or the IPR holder and cannot give to any recipient of the work permissions that exceed the scope of the distribution agreement (e.g. to allow uses of the work that are not defined in the distribution agreement)

Fee
type: ObjectProperty
sub property of: payAmount
domain: Distribution
range: Resource
type: NamedIndividual
type: Concept
term status: deprecated
definition: Specifies the costs that are required to access the resource, a fragment of the resource or to use a tool or service.

IPR Holder
type: ObjectProperty
domain: LanguageResource
range: Agent
type: NamedIndividual
type: Concept
definition: A person or an organization who holds the full Intellectual Property Rights (Copyright, trademark etc) that subsist in the resource. The IPR holder could be different from the creator that may have assigned the rights to the IPR holder (e.g. an author as a creator assigns her rights to the publisher who is the IPR holder) and the distributor that holds a specific licence (i.e. a permission) to distribute the work via a specific distributor.

License
type: ObjectProperty
sub property of: license
domain: Distribution
range: License
type: NamedIndividual
type: Concept
definition: Links a resource to the licence under which it is distributed; values are taken from a list of standard licences

License Category
type: ObjectProperty
domain: License
range: License Category
type: NamedIndividual
type: Concept
definition: A way of categorising licences into three main categories: PUB, ACA or RES, according to CLARIN recommendations (cf. https://kitwiki.csc.fi/twiki/bin/view/FinCLARIN/ClarinLC)

Licensor
type: ObjectProperty
sub property of: assigner
domain: Distribution
range: Agent
type: NamedIndividual
type: Concept
definition: The person who is legally eligible to license and actually licenses the resource. The licensor could be different from the creator, the distributor or the IPR holder. The licensor has the necessary rights or licences to license the work and is the party that actually licenses the resource that is distributed via the specific channel. She will have obtained the necessary rights or licences from the IPR holder and she may have a distribution agreement with a distributor that disseminates the work under a set of conditions defined in the specific licence and collects revenue on the licensor's behalf. The attribution of the creator, separately from the attribution of the licensor, may be part of the licence under which the resource is distributed (as e.g. is the case with Creative Commons Licences).

User Nature
type: ObjectProperty
domain: Distribution
range: User Nature
type: NamedIndividual
type: Concept
definition: Used to identify the type of user of the resource (affiliated with a commercial vs. academic institution)

Access URL
type: ObjectProperty
domain: Distribution
range: Resource
type: NamedIndividual
type: Concept
definition: Could be any kind of URL that gives access to a distribution of the dataset. E.g. landing page, download, feed URL, SPARQL endpoint. Use when your catalog does not have information on which it is or when it is definitely not a download.

Distribution
type: ObjectProperty
domain: LanguageResource
type: NamedIndividual
type: Concept
definition: Connects a dataset to one of its available distributions.

Download URL
type: ObjectProperty
domain: Distribution
range: Resource
type: NamedIndividual
type: Concept
definition: This is a direct link to a downloadable file in a given format. E.g. CSV file or RDF file. The format is described by the distribution's dc:format and/or dcat:mediaType

Attribution Name
type: DatatypeProperty
domain: Distribution
type: NamedIndividual
type: Concept
definition: The name the creator of a Work would like used when attributing re-use.

Attribution URL
type: DatatypeProperty
domain: Distribution
type: NamedIndividual
type: Concept
definition: The URL the creator of a Work would like used when attributing re-use.

Attribution Text
type: DatatypeProperty
domain: Distribution
type: NamedIndividual
type: Concept
term status: deprecated
definition: The text that must be quoted for attribution purposes when using a resource - for cases where a resource is provided with a restriction on attribution.

Authenticated
type: DatatypeProperty
range: boolean
type: NamedIndividual
type: Concept
type: LeftOperand
definition: Specifies if the user has been identified/authenticated.

Availability End Date
type: DatatypeProperty
domain: Distribution
range: date
type: NamedIndividual
type: Concept
definition: Identifies the Availability End Date of the resource.

Availability Start Date
type: DatatypeProperty
domain: Distribution
range: date
type: NamedIndividual
type: Concept
definition: Identifies the Availability Start Date of the resource.

Availability
type: Class
type: NamedIndividual
type: Concept
definition: Availability status of the resource; conditionsOfUse can be further used to indicate the specific terms of availability

Conditions of Use
type: Class
type: NamedIndividual
type: Concept
definition: The conditionsOfUse optional element in the metadata is only to be taken as providing brief human readable information on the fact that the LR is provided under a specific set of conditions. These correspond to the most frequently used conditions imposed by the licensor of the LR (via the specified licence). The proper exposition of all conditions and possible exceptions is to be found inside the licence text. LR depositors should, hence, carefully choose the values of this field to match the licence chosen and users should carefully read that licence before using the LR.

Distribution Access Medium
type: Class
type: NamedIndividual
type: Concept
definition: Specifies the medium (channel) used for delivery or providing access to the resource

License
type: Class
subclass of: LicenseDocument
type: NamedIndividual
type: Concept
broader: Policy
definition: The licence of use for the resource; for an overview of licences, please visit: http://www.meta-net.eu/meta-share/licenses.

License Category
type: Class
type: NamedIndividual
type: Concept
definition: A way of classifying licences according to their conditions of use (CLARIN recommendation)

User Nature
type: Class
type: NamedIndividual
type: Concept
definition: Identifies the type of user of the resource (e.g. affiliated with a commercial vs. academic institution, member of an organisation/network etc.); the user type may have implications on the licensing or pricing of a resource

Distribution
type: Class
type: NamedIndividual
type: Concept
broader: Asset
definition: Represents a specific available form of a dataset. Each dataset might be available in different forms, these forms might represent different formats of the dataset or different endpoints. Examples of distributions include a downloadable CSV file, an API or an RSS feed

Attribution
type: NamedIndividual
type: Conditions of Use
type: Concept
definition: Attribution refers to a kind of 'ConditionsOfUse' imposed by the licence; users must give credit to the resource owner, copyright holder or anyone else as required by the licensor by using appropriate attribution data

Share Alike
type: NamedIndividual
type: Conditions of Use
type: Concept
definition: Share Alike refers to a kind of 'ConditionsOfUse' imposed by the licence; if users create derivatives of a resource, the derivatives are to be licensed with the same license as that accompanying the original resource

ACA
type: NamedIndividual
type: License Category
type: Concept
definition: One of the values of license categories; resources of this category are only available to academic users

AGPL
type: NamedIndividual
type: License
type: Concept
legalcode: agpl-3.0.html
definition: It refers to the AGPL (GNU Affero General Public License) which is a kind of license meant to govern the use of a resource; mainly intended for s/w

Apache Licence 2.0
type: NamedIndividual
type: License
type: Concept
legalcode: LICENSE-2.0
definition: It refers to the Apache Licence 2.0 which is a kind of license meant to govern the use of a resource; mainly intended for s/w

BSD
type: NamedIndividual
type: License
type: Concept
legalcode: BSD-2-Clause
definition: It refers to the BSD (Berkeley Software Distribution) license, which is a kind of license meant to govern the use of a resource; mainly intended for s/w

BSD 3-clause
type: NamedIndividual
type: License
type: Concept
legal code: BSD-3-Clause
definition: It refers to the BSD 3-clause (Berkeley Software Distribution) license, which is a kind of license meant to govern the use of a resource; mainly intended for s/w

CC-BY
type: NamedIndividual
type: License
type: Concept
legal code: legalcode
definition: It refers to CC-BY which is a kind of license meant to govern the use of a resource

CC-BY-NC
type: NamedIndividual
type: License
type: Concept
legal code: legalcode
definition: It refers to CC-BY-NC which is a kind of license meant to govern the use of a resource

CC-BY-NC-ND
type: NamedIndividual
type: License
type: Concept
legal code: legalcode
definition: It refers to CC-BY-NC-ND which is a kind of license meant to govern the use of a resource

CC-BY-NC-SA
type: NamedIndividual
type: License
type: Concept
legal code: legalcode
definition: It refers to CC-BY-NC-SA which is a kind of license meant to govern the use of a resource

CC-BY-ND
type: NamedIndividual
type: License
type: Concept
legal code: legalcode
definition: It refers to CC-BY-ND which is a kind of license meant to govern the use of a resource

CC-BY-SA
type: NamedIndividual
type: License
type: Concept
legal code: legalcode
definition: It refers to CC-BY-SA which is a kind of license meant to govern the use of a resource

CC-ZERO
type: NamedIndividual
type: License
type: Concept
legal code: legalcode
definition: It refers to CC-ZERO which is a kind of license meant to govern the use of a resource

CD-ROM
type: NamedIndividual
type: Distribution Access Medium
type: Concept
definition: CD-ROM refers to a kind of distribution/access medium used for delivering a language resource; intended for resources delivered on CD-ROM

CLARIN_ACA
type: NamedIndividual
type: License
type: Concept
definition: It refers to CLARIN_ACA which is a kind of license meant to govern the use of a resource

CLARIN_ACA-NC
type: NamedIndividual
type: License
type: Concept
definition: It refers to CLARIN_ACA-NC which is a kind of license meant to govern the use of a resource

CLARIN_PUB
type: NamedIndividual
type: License
type: Concept
definition: It refers to CLARIN_PUB which is a kind of license meant to govern the use of a resource

CLARIN_RES
type: NamedIndividual
type: License
type: Concept
definition: It refers to CLARIN_RES which is a kind of license meant to govern the use of a resource

DVD-R
type: NamedIndividual
type: Distribution Access Medium
type: Concept
definition: DVD-R refers to a kind of distribution/access medium used for delivering a language resource; intended for resources delivered on DVD-R disks

ELRA_END_USER
type: NamedIndividual
type: License
type: Concept
definition: It refers to ELRA_END_USER which is a kind of license meant to govern the use of a resource

ELRA_EVALUATION
type: NamedIndividual
type: License
type: Concept
definition: It refers to ELRA_EVALUATION which is a kind of license meant to govern the use of a resource

ELRA_VAR
type: NamedIndividual
type: License
type: Concept
definition: It refers to ELRA_VAR which is a kind of license meant to govern the use of a resource

GFDL
type: NamedIndividual
type: License
type: Concept
legalcode: fdl.html
definition: It refers to GFDL (GNU Free Documentation License) which is a kind of license meant to govern the use of a resource; mainly intended for documents (e.g. manuals, textbooks etc.)

GPL
type: NamedIndividual
type: License
type: Concept
legalcode: gpl.html
definition: It refers to GPL (GNU General Public Licence) which is a kind of license meant to govern the use of a resource; mainly intended for s/w

LGPL
type: NamedIndividual
type: License
type: Concept
legalcode: lgpl.html
definition: It refers to LGPL (GNU Lesser General Public Licence) which is a kind of license meant to govern the use of a resource; mainly intended for s/w

MS-C-NoReD
type: NamedIndividual
type: License
type: Concept
legal code: META-SHARE Commercial NoRedistribution v0 7.pdf
definition: It refers to MS-C-NoReD which is a kind of license meant to govern the use of a resource

MS-C-NoReD-FF
type: NamedIndividual
type: License
type: Concept
legal code: META-SHARE Commercial NoRedistribution For-a-Fee v0 7.pdf
definition: It refers to MS-C-NoReD-FF which is a kind of license meant to govern the use of a resource

MS-C-NoReD-ND
type: NamedIndividual
type: License
type: Concept
legal code: META-SHARE Commercial NoRedistribution NoDerivatives-v1.0.pdf
definition: It refers to MS-C-NoReD-ND which is a kind of license meant to govern the use of a resource

MS-C-NoReD-ND-FF
type: NamedIndividual
type: License
type: Concept
legal code: META-SHARE Commercial NoRedistribution NoDerivatives For-a-fee-v1.0.pdf
definition: It refers to MS-C-NoReD-ND-FF which is a kind of license meant to govern the use of a resource

MS-NC-NoReD
type: NamedIndividual
type: License
type: Concept
legal code: META-SHARE NonCommercial NoRedistribution-v 1.0.pdf
definition: It refers to MS-NC-NoReD which is a kind of license meant to govern the use of a resource

MS-NC-NoReD-FF
type: NamedIndividual
type: License
type: Concept
legal code: META-SHARE NonCommercial NoRedistribution For-a-Fee-v 1.0.pdf
definition: It refers to MS-NC-NoReD-FF which is a kind of license meant to govern the use of a resource

MS-NC-NoReD-ND
type: NamedIndividual
type: License
type: Concept
legal code: META-SHARE NonCommercial NoRedistribution NoDerivatives-v1.0.pdf
definition: It refers to MS-NC-NoReD-ND which is a kind of license meant to govern the use of a resource

MS-NC-NoReD-ND-FF
type: NamedIndividual
type: License
type: Concept
legal code: META-SHARE NonCommercial NoRedistribution NoDerivatives For-a-fee-v 1.0.pdf
definition: It refers to MS-NC-NoReD-ND-FF which is a kind of license meant to govern the use of a resource

MSCommons-BY
type: NamedIndividual
type: License
type: Concept
legal code: META-SHARE COMMONS BY v1.0.pdf
definition: It refers to MSCommons-BY which is a kind of license meant to govern the use of a resource

MSCommons-BY-NC
type: NamedIndividual
type: License
type: Concept
legal code: META-SHARE COMMONS BYNC v1.0.pdf
definition: It refers to MSCommons-BY-NC which is a kind of license meant to govern the use of a resource

MSCommons-BY-NC-ND
type: NamedIndividual
type: License
type: Concept
legal code: META-SHARE COMMONS BYNCND v1.0.pdf
definition: It refers to MSCommons-BY-NC-ND which is a kind of license meant to govern the use of a resource

MSCommons-BY-NC-SA
type: NamedIndividual
type: License
type: Concept
legal code: META-SHARE COMMONS BYNCSA v1.0.pdf
definition: It refers to MSCommons-BY-NC-SA which is a kind of license meant to govern the use of a resource

MSCommons-BY-ND
type: NamedIndividual
type: License
type: Concept
legal code: META-SHARE COMMONS BYND v1.0.pdf
definition: It refers to MSCommons-BY-ND which is a kind of license meant to govern the use of a resource

MSCommons-BY-SA
type: NamedIndividual
type: License
type: Concept
legal code: META-SHARE COMMONS BYSA v1.0.pdf
definition: It refers to MSCommons-BY-SA which is a kind of license meant to govern the use of a resource

PUB
type: NamedIndividual
type: License Category
type: Concept
definition: One of the values of license categories; resources of this category are available to all users (although other terms and conditions may apply)

Princeton_Wordnet License
type: NamedIndividual
type: License
type: Concept
legal code: license
definition: It refers to Princeton_Wordnet license which is a kind of license meant to govern the use of a resource (namely wordnet)

RES
type: NamedIndividual
type: License Category
type: Concept
definition: One of the values of license categories; resources of this category are available to all users but under conditions that require that the user is authorised before having access to the resource

Academic User
type: NamedIndividual
type: User Nature
type: Concept
definition: It refers to resource users affiliated with an academic institution

Accessible Through Interface
type: NamedIndividual
type: Distribution Access Medium
type: Concept
definition: accessibleThroughInterface refers to a kind of distribution/access medium used for delivering a language resource; intended for resources that can only be accessed with an i/f (e.g. lexical query or corpus query systems)

Available: Restricted Use
type: NamedIndividual
type: Availability
type: Concept
definition: For resources available but with conditions of use imposed by the type of licence.

Available: Unrestricted Use
type: NamedIndividual
type: Availability
type: Concept
definition: For resources available with no restrictions of use (e.g. public domain resources).

Available Through Other Distributor
type: NamedIndividual
type: Availability
type: Concept
definition: For resources that are documented in the catalogue but the contents of which can only be accessed through other distribution channels.

Blu-ray
type: NamedIndividual
type: Distribution Access Medium
type: Concept
definition: bluRay refers to a kind of distribution/access medium used for delivering a language resource; intended for resources delivered on bluRay disks

Commercial User
type: NamedIndividual
type: User Nature
type: Concept
definition: It refers to resource users affiliated with a commercial institution

communicate
type: NamedIndividual
type: Concept
definition: The Assigner permits/prohibits the Assignees to communicate the Asset to the public

Downloadable
type: NamedIndividual
type: Distribution Access Medium
type: Concept
definition: downloadable refers to a kind of distribution/access medium used for delivering a language resource; intended for resources delivered as downloadable files

Education
type: NamedIndividual
type: Conditions of Use
type: Concept
definition: Education refers to a kind of 'ConditionsOfUse' imposed by the licence; the resource can only be used for educational purposes.

Evaluation
type: NamedIndividual
type: Conditions of Use
type: Concept
definition: Evaluation refers to a kind of 'ConditionsOfUse' imposed by the licence; use for evaluation purposes (cf. ELRA_EVALUATION license)

Hard Disk
type: NamedIndividual
type: Distribution Access Medium
type: Concept
definition: hardDisk refers to a kind of distribution/access medium used for delivering a language resource; intended for resources delivered in hard disks

incorporate
type: NamedIndividual
type: Concept
broader transitive: use
definition: The Assigner permits/prohibits the Assignees to incorporate the Asset unmodified into a Collective Work.

Inform Licensor
type: NamedIndividual
type: Conditions of Use
type: Concept
definition: Inform Licensor refers to a kind of 'ConditionsOfUse' imposed by the licence; users must inform the licensor as to the kind of use they make of the resource

Language Engineering Research
type: NamedIndividual
type: Conditions of Use
type: Concept
definition: Language engineering research refers to a kind of 'ConditionsOfUse' imposed by the licence; the resource can only be used for research purposes in the Language Enginnering / Language Technology domain.

Member Of ELRA
type: NamedIndividual
type: User Nature
type: Concept
definition: Used for stating pricing privileges for members of ELRA with regard to the distribution of a resource

Member Of LDC
type: NamedIndividual
type: User Nature
type: Concept
definition: Used for stating pricing privileges for members of LDC with regard to the distribution of a resource

Member of TST-Centrale
type: NamedIndividual
type: User Nature
type: Concept
definition: Used for stating pricing privileges for members of TST-Centrale with regard to the distribution of a resource

No Derivatives
type: NamedIndividual
type: Conditions of Use
type: Concept
definition: No Derivatives refers to a kind of 'ConditionsOfUse' imposed by the licence; users are not allow to share derivatives of the resource

No Redistribution
type: NamedIndividual
type: Conditions of Use
type: Concept
definition: No Redistribution refers to a kind of 'ConditionsOfUse' imposed by the licence; users are not allowed to redistribute the resource

Non-Commercial Use
type: NamedIndividual
type: Conditions of Use
type: Concept
definition: Non-commercial use refers to a kind of 'ConditionsOfUse' imposed by the licence; use for non commercial purposes, such as research and education by academic users

Only Meta Share members
type: NamedIndividual
type: Conditions of Use
type: Concept
definition: Only Meta Share members refers to a kind of 'ConditionsOfUse' imposed by the licence; the resource can only be used by members of the MetaShare network

Open For Reuse With Restrictions
type: NamedIndividual
type: License
type: Concept
definition: It refers to any kind of license that governs the use of a resource permitting certain automatic processing procedures but with specific restrictions; the end user is advised to check the conditionsOfUse metadata element for a quick overview of the rights granted for the use of the resource and to read carefully the full license text

Paper Copy
type: NamedIndividual
type: Distribution Access Medium
type: Concept
definition: paperCopy refers to a kind of distribution/access medium used for delivering a language resource; intended for resources delivered in printout form

Personal Data Included
type: NamedIndividual
type: Conditions of Use
type: Concept
definition: PersonalDataIncluded refers to a kind of 'ConditionsOfUse' imposed by the licence; it's a privacy warning for resources that include personal data.

proprietary
type: NamedIndividual
type: License
type: Concept
definition: It refers to any kind of proprietary license meant to govern the use of a resource; the rights holder has exclusive legal rights over the license itself; the end user is advised to check the conditionsOfUse metadata element for a quick overview of the rights granted for the use of the resource and pay attention to the full license text;

Redeposit
type: NamedIndividual
type: Conditions of Use
type: Concept
definition: Redeposit refers to a kind of 'ConditionsOfUse' imposed by the licence; users are encouraged to deposit any modified versions of the resource they make to the distribution channel through which they have acquired the resource

Request Plan
type: NamedIndividual
type: Conditions of Use
type: Concept
definition: RequestPlan refers to a kind of 'ConditionsOfUse' imposed by the licence; the licensor requires a research plan for granting access.

Research
type: NamedIndividual
type: Conditions of Use
type: Concept
definition: Research refers to a kind of 'ConditionsOfUse' imposed by the licence; the resource can only be used for research purposes.

Spatial Constraint
type: NamedIndividual
type: Conditions of Use
type: Concept
definition: Spatial constraint refers to a kind of 'ConditionsOfUse' imposed by the licence; used for resources with spatial restrictions, e.g. the content is available or can be used only at a single location, center, or site.

Under Negotiation
type: NamedIndividual
type: Availability
type: Concept
definition: For resources whose availability is still pending.

User Identified
type: NamedIndividual
type: Conditions of Use
type: Concept
definition: UserIdentified refers to a kind of 'ConditionsOfUse' imposed by the licence; the resource can only be accessed by users that are identified/authenticated.

Web Executable
type: NamedIndividual
type: Distribution Access Medium
type: Concept
definition: webExecutable refers to a kind of distribution/access medium used for delivering a language resource; intended for web services

Compensate
type: NamedIndividual
type: Conditions of Use
type: Concept
definition: Compensate refers to a kind of 'ConditionsOfUse' imposed by the licence; grant of use for the resource is only given if a certain fee is compensated.